BDBM363694 US10689414, Compound 181::US10717764, Compound 181::US11021515, Compound 181::US11667673, Compound 181::US9850277, Compound 181
SMILES FC(F)Oc1cccc(c1)N([C@H](C(=O)NC1CC(F)(F)C1)c1ccccc1Cl)C(=O)[C@@H]1CCC(=O)N1c1cc(ccn1)C#N
InChI Key InChIKey=IQBNCPMUMOBIBD-OZXSUGGESA-N
Data  10 IC50
  Tab Delimited (TSV)   2D SDfile   Computed 3D by Vconf -m prep SDfile
Find this compound or compounds like it in BindingDB:
Activity Spreadsheet -- Enzyme Inhibition Constant Data from BindingDB
Found 10 hits for monomerid = 363694
TargetIsocitrate dehydrogenase [NADP] cytoplasmic [R132C](Homo sapiens (Human))
Agios Pharmaceuticals
US Patent
LigandPNGBDBM363694(US10689414, Compound 181 | US10717764, Compound 18...)
Affinity DataIC50: <500nM. Assay description: A test compound is prepared as 10 mM stock in DMSO and diluted to 50× final concentration in DMSO, for a 50 μl reaction mixture. IDH enzyme acti...
Ligand InfoPC cidPC sid
In DepthDetails US Patent
TargetIsocitrate dehydrogenase [NADP] cytoplasmic [R132H](Homo sapiens (Human))
Agios Pharmaceuticals
US Patent
LigandPNGBDBM363694(US10689414, Compound 181 | US10717764, Compound 18...)
Affinity DataIC50: <500nM. Assay description: A test compound is prepared as 10 mM stock in DMSO and diluted to 50× final concentration in DMSO, for a 50 μl reaction mixture. IDH enzyme acti...
Ligand InfoPC cidPC sid
In DepthDetails US Patent
TargetIsocitrate dehydrogenase [NADP] cytoplasmic [R132C](Homo sapiens (Human))
Agios Pharmaceuticals
US Patent
LigandPNGBDBM363694(US10689414, Compound 181 | US10717764, Compound 18...)
Affinity DataIC50: <100nM. Assay description: A test compound is prepared as 10 mM stock in DMSO and diluted to 50× final concentration in DMSO, for a 50 μl reaction mixture. IDH enzyme acti...
Ligand InfoPC cidPC sid
In DepthDetails US Patent
TargetIsocitrate dehydrogenase [NADP] cytoplasmic [R132H](Homo sapiens (Human))
Agios Pharmaceuticals
US Patent
LigandPNGBDBM363694(US10689414, Compound 181 | US10717764, Compound 18...)
Affinity DataIC50: <100nM. Assay description: A test compound is prepared as 10 mM stock in DMSO and diluted to 50× final concentration in DMSO, for a 50 μl reaction mixture. IDH enzyme acti...
Ligand InfoPC cidPC sid
In DepthDetails US Patent
TargetIsocitrate dehydrogenase [NADP] cytoplasmic [R132H](Homo sapiens (Human))
Agios Pharmaceuticals
US Patent
LigandPNGBDBM363694(US10689414, Compound 181 | US10717764, Compound 18...)
Affinity DataIC50: <100nM
Ligand InfoPC cidPC sid
In DepthDetails US Patent
TargetIsocitrate dehydrogenase [NADP] cytoplasmic [R132C](Homo sapiens (Human))
Agios Pharmaceuticals
US Patent
LigandPNGBDBM363694(US10689414, Compound 181 | US10717764, Compound 18...)
Affinity DataIC50: <100nM. Assay description: A test compound is prepared as 10 mM stock in DMSO and diluted to 50× final concentration in DMSO, for a 50 μl reaction mixture. IDH enzyme acti...
Ligand InfoPC cidPC sid
In DepthDetails US Patent
TargetIsocitrate dehydrogenase [NADP] cytoplasmic [R132H](Homo sapiens (Human))
Agios Pharmaceuticals
US Patent
LigandPNGBDBM363694(US10689414, Compound 181 | US10717764, Compound 18...)
Affinity DataIC50: <100nM. Assay description: A test compound is prepared as 10 mM stock in DMSO and diluted to 50× final concentration in DMSO, for a 50 μl reaction mixture. IDH enzyme acti...
Ligand InfoPC cidPC sid
In DepthDetails US Patent
TargetIsocitrate dehydrogenase [NADP] cytoplasmic [R132C](Homo sapiens (Human))
Agios Pharmaceuticals
US Patent
LigandPNGBDBM363694(US10689414, Compound 181 | US10717764, Compound 18...)
Affinity DataIC50: <100nM
Ligand InfoPC cidPC sid
In DepthDetails US Patent
TargetIsocitrate dehydrogenase [NADP] cytoplasmic [R132C](Homo sapiens (Human))
Agios Pharmaceuticals
US Patent
LigandPNGBDBM363694(US10689414, Compound 181 | US10717764, Compound 18...)
Affinity DataIC50: <100nM. Assay description: A test compound is prepared as 10 mM stock in DMSO and diluted to 50× final concentration in DMSO, for a 50 μl reaction mixture. IDH enzyme acti...
Ligand InfoPC cidPC sid
In DepthDetails US Patent
TargetIsocitrate dehydrogenase [NADP] cytoplasmic [R132H](Homo sapiens (Human))
Agios Pharmaceuticals
US Patent
LigandPNGBDBM363694(US10689414, Compound 181 | US10717764, Compound 18...)
Affinity DataIC50: <100nM. Assay description: A test compound is prepared as 10 mM stock in DMSO and diluted to 50× final concentration in DMSO, for a 50 μl reaction mixture. IDH enzyme acti...
Ligand InfoPC cidPC sid
In DepthDetails US Patent