BDBM36391 5-Hydroxymethyl-7-isopropoxy-6-oxa-bicyclo[3.2.2]nonane-1,8,9-triol, 16::CID24752824
SMILES CCO[C@@H]1O[C@@]2(CO)CCC[C@]1(O)[C@@H](O)[C@@H]2O
InChI Key InChIKey=NAIWJQRQLFETPD-DAWVFNFOSA-N
Data  1 KI
  Tab Delimited (TSV)   2D SDfile   Computed 3D by Vconf -m prep SDfile
Find this compound or compounds like it in BindingDB:
Activity Spreadsheet -- Enzyme Inhibition Constant Data from BindingDB
Found 1 hit for monomerid = 36391
TargetBeta-mannosidase(Bacteroides thetaiotaomicron)
The Medical School, Newcastle University
LigandPNGBDBM36391(5-Hydroxymethyl-7-isopropoxy-6-oxa-bicyclo[3.2.2]n...)
Affinity DataKi: >4.00E+8nM ΔG°: >-0.564kcal/molepH: 5.6 T: 2°C. Assay description: Putative mannosidase assay using wild-type protein Btman2A. Enzyme inhibition assay.
In DepthDetails ArticlePubMed