BDBM365304 (2-Methoxy-4-methyl- phenyl)-{3-[6-(4-methyl- pyridin-2-ylamino)-2-(2- methyl-pyrrolidin-1-yl)- pyrimidin-4-yl]-piperidin- 1-yl}-methanone::US9868720, No. 425
SMILES COc1cc(C)ccc1C(=O)N1CCCC(C1)c1cc(Nc2cc(C)ccn2)nc(n1)N1CCCC1C
InChI Key InChIKey=DBMHHJQHVRPUPO-UHFFFAOYSA-N
Data  1 KI
  Tab Delimited (TSV)   2D SDfile   Computed 3D by Vconf -m prep SDfile
Find this compound or compounds like it in BindingDB:
Activity Spreadsheet -- Enzyme Inhibition Constant Data from BindingDB
Found 1 hit for monomerid = 365304
TargetMitogen-activated protein kinase kinase kinase 12(Homo sapiens (Human))
Genentech
US Patent
LigandPNGBDBM365304((2-Methoxy-4-methyl- phenyl)-{3-[6-(4-methyl- pyri...)
Affinity DataKi:  0.170nM. Assay description: DLK kinase reactions (20 μL) containing 5 nM N-terminally GST-tagged DLK (catalytic domain amino acid 1-520) (Carna Bioscience), 40 nM N-termina...
Ligand InfoPC cidPC sid
In DepthDetails US Patent