BDBM36628 Rapamycin C-7, analog 17a
SMILES CO[C@@H]1C[C@H](C[C@@H](C)[C@@H]2CC(=O)[C@H](C)\C=C(C)\[C@@H](O)[C@@H](OC)C(=O)[C@H](C)C[C@H](C)\C=C\C=C\C=C(C)\[C@@H](C[C@@H]3CC[C@@H](C)[C@@](O)(O3)C(=O)C(=O)N3CCCC[C@H]3C(=O)O2)OCc2ccc(N=[N]#N)c(I)c2)CC[C@H]1O
InChI Key InChIKey=QBLTWNKRQOREEF-DLDCRHPXSA-N
Data  1 KI  1 EC50
  Tab Delimited (TSV)   2D SDfile   Computed 3D by Vconf -m prep SDfile
Find this compound or compounds like it in BindingDB:
Activity Spreadsheet -- Enzyme Inhibition Constant Data from BindingDB
Found 1 hit for monomerid = 36628
TargetPeptidyl-prolyl cis-trans isomerase FKBP1A(Homo sapiens (Human))
Smithkline Beecham Pharmaceuticals
LigandPNGBDBM36628(Rapamycin C-7, analog 17a)
Affinity DataKi:  30nM EC50:  90nM. Assay description: FKBP12 assay using rapamycin analogs.
In DepthDetails ArticlePubMed