BDBM36706 Dansyltyrosine deriviative 25B
SMILES CN(C)c1cccc2c(cccc12)S(=O)(=O)Oc1ccc(C[C@H](NS(=O)(=O)c2ccc(NC(C)=O)cc2)C(O)=O)cc1
InChI Key InChIKey=HKTYWHRZEGXFIM-SANMLTNESA-N
Data  1 IC50
  Tab Delimited (TSV)   2D SDfile   Computed 3D by Vconf -m prep SDfile
Find this compound or compounds like it in BindingDB:
Activity Spreadsheet -- Enzyme Inhibition Constant Data from BindingDB
Found 1 hit for monomerid = 36706
TargetThymidylate synthase(Lactobacillus casei)
Northwestern University
LigandPNGBDBM36706(Dansyltyrosine deriviative 25B)
Affinity DataIC50:  2.90E+4nMpH: 7.4 T: 2°C. Assay description: The enzyme assay were performed spectrophotometrically by following the absorbance at 340nm using a hewlett Packard 8453 UV spectrophotometer equippe...
In DepthDetails ArticlePubMed