BDBM367368 N,N-Dimethyl-4-oxo-3-(phenylamino)-2-(pyridin-4-yl)-4,5,6,7-tetrahydro-1H-indol-6-carboxamide Isomer 1::US10227299, Example 59::US10227299, Example 60
SMILES CN(C)C(=O)C1Cc2[nH]c(c(Nc3ccccc3)c2C(=O)C1)-c1ccncc1
InChI Key
Data  2 IC50
  Tab Delimited (TSV)   2D SDfile   Computed 3D by Vconf -m prep SDfile
Find this compound or compounds like it in BindingDB:
Activity Spreadsheet -- Enzyme Inhibition Constant Data from BindingDB
Found 2 hits for monomerid = 367368
TargetMitotic checkpoint serine/threonine-protein kinase BUB1(Homo sapiens (Human))
Bayer Pharma Aktiengesellschaft
US Patent
LigandPNGBDBM367368(N,N-Dimethyl-4-oxo-3-(phenylamino)-2-(pyridin-4-yl...)
Affinity DataIC50:  14nM. Assay description: Bub1-inhibitory activities of compounds described in the present invention were quantified using a time-resolved fluorescence energy transfer (TR-FRE...
Ligand InfoPC cidPC sid
In DepthDetails US Patent
TargetMitotic checkpoint serine/threonine-protein kinase BUB1(Homo sapiens (Human))
Bayer Pharma Aktiengesellschaft
US Patent
LigandPNGBDBM367368(N,N-Dimethyl-4-oxo-3-(phenylamino)-2-(pyridin-4-yl...)
Affinity DataIC50:  4nM. Assay description: Bub1-inhibitory activities of compounds described in the present invention were quantified using a time-resolved fluorescence energy transfer (TR-FRE...
Ligand InfoPC cidPC sid
In DepthDetails US Patent