BDBM368 (3S)-oxolan-3-yl N-[(2S,3R)-4-[(4aS,8aS)-3-(tert-butylcarbamoyl)-decahydroisoquinolin-2-yl]-3-hydroxy-1-phenylbutan-2-yl]carbamate::Sulfone Deriv. 1
SMILES [H][C@@]12CCCC[C@]1([H])CN(C[C@@H](O)[C@H](Cc1ccccc1)NC(=O)O[C@H]1CCOC1)C(C2)C(=O)NC(C)(C)C
InChI Key InChIKey=RWJPHGJNZTXMGR-XCXWGBNBSA-N
Data  1 IC50
  Tab Delimited (TSV)   2D SDfile   Computed 3D by Vconf -m prep SDfile
Find this compound or compounds like it in BindingDB:
Activity Spreadsheet -- Enzyme Inhibition Constant Data from BindingDB
Found 1 hit for monomerid = 368
TargetDimer of Gag-Pol polyprotein [489-587](Human immunodeficiency virus type 1)
Merck Research Laboratories
LigandPNGBDBM368((3S)-oxolan-3-yl N-[(2S,3R)-4-[(4aS,8aS)-3-(tert-b...)
Affinity DataIC50:  160nMpH: 5.5 T: 2°C. Assay description: Sensitivity of HIV-1 protease activity to protease inhibitors was determined by a peptide substrate cleavage assay. Protease products were analyzed o...
In DepthDetails ArticlePubMed