BDBM368272 US10227338, Example 55
SMILES CNC1CCN(C1)c1cc(OC)ccc1Nc1cc(F)c(cc1Cl)S(=O)(=O)Nc1cscn1
InChI Key InChIKey=HLXXLWYRTBFKGP-UHFFFAOYSA-N
Data  2 IC50
  Tab Delimited (TSV)   2D SDfile   Computed 3D by Vconf -m prep SDfile
Find this compound or compounds like it in BindingDB:
Activity Spreadsheet -- Enzyme Inhibition Constant Data from BindingDB
Found 2 hits for monomerid = 368272
TargetSodium channel protein type 5 subunit alpha(Homo sapiens (Human))
Daewoong Pharmaceutical
US Patent
LigandPNGBDBM368272(US10227338, Example 55)
Affinity DataIC50: >1.00E+4nM. Assay description: In order to measure the sodium ion channel blocking effect, an IonFlux16 Auto patch clamp system (Fluxion, Inc.) and a plate for exclusive use were u...
Ligand InfoPC cidPC sid
In DepthDetails US Patent
TargetSodium channel protein type 9 subunit alpha(Homo sapiens (Human))
Daewoong Pharmaceutical
US Patent
LigandPNGBDBM368272(US10227338, Example 55)
Affinity DataIC50:  12nM. Assay description: In order to measure the sodium ion channel blocking effect, an IonFlux16 Auto patch clamp system (Fluxion, Inc.) and a plate for exclusive use were u...
Ligand InfoPC cidPC sid
In DepthDetails US Patent