BDBM368283 US10227338, Example 66
SMILES CN1CCN(CC1)c1cc(OC(F)F)ccc1Nc1cc(F)c(cc1Cl)S(=O)(=O)Nc1cscn1
InChI Key InChIKey=VVKVULUHIRQMHK-UHFFFAOYSA-N
Data  1 IC50
  Tab Delimited (TSV)   2D SDfile   Computed 3D by Vconf -m prep SDfile
Find this compound or compounds like it in BindingDB:
Activity Spreadsheet -- Enzyme Inhibition Constant Data from BindingDB
Found 1 hit for monomerid = 368283
TargetSodium channel protein type 9 subunit alpha(Homo sapiens (Human))
Daewoong Pharmaceutical
US Patent
LigandPNGBDBM368283(US10227338, Example 66)
Affinity DataIC50:  160nM. Assay description: In order to measure the sodium ion channel blocking effect, an IonFlux16 Auto patch clamp system (Fluxion, Inc.) and a plate for exclusive use were u...
Ligand InfoPC cidPC sid
In DepthDetails US Patent