BDBM368332 US10227338, Example 119
SMILES CNCCN(C)c1cc(OC)ccc1Nc1cc(F)c(cc1Cl)S(=O)(=O)Nc1nccs1
InChI Key InChIKey=CXHZIIZCSZQZCE-UHFFFAOYSA-N
Data  1 IC50
  Tab Delimited (TSV)   2D SDfile   Computed 3D by Vconf -m prep SDfile
Find this compound or compounds like it in BindingDB:
Activity Spreadsheet -- Enzyme Inhibition Constant Data from BindingDB
Found 1 hit for monomerid = 368332
TargetSodium channel protein type 9 subunit alpha(Homo sapiens (Human))
Daewoong Pharmaceutical
US Patent
LigandPNGBDBM368332(US10227338, Example 119)
Affinity DataIC50:  20nM. Assay description: In order to measure the sodium ion channel blocking effect, an IonFlux16 Auto patch clamp system (Fluxion, Inc.) and a plate for exclusive use were u...
Ligand InfoPC cidPC sid
In DepthDetails US Patent