BDBM371054 US10239843, Example 161
SMILES Cc1ncc(Cn2c(=O)n(CC#C)c3ccc(cc3c2=O)S(=O)(=O)NC2(C)CC2)s1
InChI Key InChIKey=ZTRGGZMUZCZXTL-UHFFFAOYSA-N
Data  3 IC50  2 EC50
  Tab Delimited (TSV)   2D SDfile   Computed 3D by Vconf -m prep SDfile
Find this compound or compounds like it in BindingDB:
Activity Spreadsheet -- Enzyme Inhibition Constant Data from BindingDB
Found 5 hits for monomerid = 371054
TargetPoly(ADP-ribose) glycohydrolase(Homo sapiens (Human))
Cancer Research Technology
US Patent
LigandPNGBDBM371054(US10239843, Example 161)
Affinity DataIC50:  45nM. Assay description: PARG In vitro assays were conducted in a total volume of 15 ul in a standard 384 well format. 5 ul of Human Full Length PARG (Produced internally by ...
Ligand InfoPC cidPC sid
In DepthDetails US Patent
TargetADP-ribosylhydrolase ARH3(Homo sapiens (Human))
Cancer Research Technology
US Patent
LigandPNGBDBM371054(US10239843, Example 161)
Affinity DataIC50: >1.00E+5nM. Assay description: ARH3 In vitro selectivity assays were conducted in a total volume of 15 ul in a standard 384 well format. 5 ul of Human Full Length ARH3 (Enzo Life S...
Ligand InfoPC cidPC sid
In DepthDetails US Patent
TargetPoly(ADP-ribose) glycohydrolase(Homo sapiens (Human))
Cancer Research Technology
US Patent
LigandPNGBDBM371054(US10239843, Example 161)
Affinity DataEC50:  45nM. Assay description: Inhibition of human full length PARG using Bt-NAD ribosylated PARP1 substrate after 10 mins by TR-FRET assay
Ligand InfoPC cidPC sid
In DepthDetails ArticlePubMed
TargetPoly(ADP-ribose) glycohydrolase(Homo sapiens (Human))
Cancer Research Technology
US Patent
LigandPNGBDBM371054(US10239843, Example 161)
Affinity DataEC50:  82nM. Assay description: Inhibition of PARG in human HeLa cells assessed as induction of MMS-induced PAR chains preincubated for 1 hr followed by MMS addition and measured af...
Ligand InfoPC cidPC sid
In DepthDetails ArticlePubMed
TargetPoly [ADP-ribose] polymerase 1(Homo sapiens (Human))
Cancer Research Technology
US Patent
LigandPNGBDBM371054(US10239843, Example 161)
Affinity DataIC50: >1.50E+5nM. Assay description: PARP1 In vitro selectivity assays were conducted as a 10 ul reaction volume in a NUNC Maxisorp 384-well assay plate pre-coated in-house with Histones...
Ligand InfoPC cidPC sid
In DepthDetails US Patent