BDBM371057 US10239843, Example 164
SMILES Cc1cc(COc2nc3ccc(cc3c(=O)n2Cc2cnc(C)s2)S(=O)(=O)NC2(C)CC2)n(C)n1
InChI Key InChIKey=QROYTPZFYDKIQE-UHFFFAOYSA-N
Data  1 IC50
  Tab Delimited (TSV)   2D SDfile   Computed 3D by Vconf -m prep SDfile
Find this compound or compounds like it in BindingDB:
Activity Spreadsheet -- Enzyme Inhibition Constant Data from BindingDB
Found 1 hit for monomerid = 371057
TargetPoly(ADP-ribose) glycohydrolase(Homo sapiens (Human))
Cancer Research Technology
US Patent
LigandPNGBDBM371057(US10239843, Example 164)
Affinity DataIC50:  343nM. Assay description: PARG In vitro assays were conducted in a total volume of 15 ul in a standard 384 well format. 5 ul of Human Full Length PARG (Produced internally by ...
Ligand InfoPC cidPC sid
In DepthDetails US Patent