BDBM371226 US10239843, Example 333
SMILES CN1CCC(CNC(=O)c2nn(Cc3cc(C)no3)c(=O)c3cc(ccc23)S(=O)(=O)NC2(C)CC2)CC1
InChI Key InChIKey=HITLITNGINFNKT-UHFFFAOYSA-N
Data  1 IC50
  Tab Delimited (TSV)   2D SDfile   Computed 3D by Vconf -m prep SDfile
Find this compound or compounds like it in BindingDB:
Activity Spreadsheet -- Enzyme Inhibition Constant Data from BindingDB
Found 1 hit for monomerid = 371226
TargetPoly(ADP-ribose) glycohydrolase(Homo sapiens (Human))
Cancer Research Technology
US Patent
LigandPNGBDBM371226(US10239843, Example 333)
Affinity DataIC50:  781nM. Assay description: PARG In vitro assays were conducted in a total volume of 15 ul in a standard 384 well format. 5 ul of Human Full Length PARG (Produced internally by ...
Ligand InfoPC cidPC sid
In DepthDetails US Patent