BDBM371272 US10239843, Example 379
SMILES Cc1cc(Cn2c3ccc(cc3c(=O)n(Cc3cnn(C)c3)c2=O)S(=O)(=O)NC2(C)CC2)on1
InChI Key InChIKey=JLPGREMZEFAKHM-UHFFFAOYSA-N
Data  1 IC50
  Tab Delimited (TSV)   2D SDfile   Computed 3D by Vconf -m prep SDfile
Find this compound or compounds like it in BindingDB:
Activity Spreadsheet -- Enzyme Inhibition Constant Data from BindingDB
Found 1 hit for monomerid = 371272
TargetPoly(ADP-ribose) glycohydrolase(Homo sapiens (Human))
Cancer Research Technology
US Patent
LigandPNGBDBM371272(US10239843, Example 379)
Affinity DataIC50:  35nM. Assay description: PARG In vitro assays were conducted in a total volume of 15 ul in a standard 384 well format. 5 ul of Human Full Length PARG (Produced internally by ...
Ligand InfoPC cidPC sid
In DepthDetails US Patent