BDBM373261 FD-2013027::US9902709, Compound Example 5
SMILES Cc1c(Oc2ccc(NC(=O)Nc3ccc(Cl)c(c3)C(F)(F)F)cc2)ccnc1-c1cnn(C)c1
InChI Key InChIKey=QMTYMFAGVZGZBJ-UHFFFAOYSA-N
Data  1 IC50
  Tab Delimited (TSV)   2D SDfile   Computed 3D by Vconf -m prep SDfile
Find this compound or compounds like it in BindingDB:
Activity Spreadsheet -- Enzyme Inhibition Constant Data from BindingDB
Found 1 hit for monomerid = 373261
TargetVascular endothelial growth factor receptor 2(Homo sapiens (Human))
Peking University Founder Group
US Patent
LigandPNGBDBM373261(FD-2013027 | US9902709, Compound Example 5)
Affinity DataIC50:  317nM. Assay description: Kinase Enzymatic step assay Control (10 μL) Sample Negative Positive Compound 4 μL 4 μL 2.5% 4 μL 2.5% DMSO/kinase DMSO/kinase bu...
Ligand InfoPC cidPC sid
In DepthDetails US Patent