BDBM378744 N-(1-((1-(4-chlorobenzyl)-1H-pyrazol-4-yl)methyl)azetidin-3-yl)-4-cyclopropyl-1H-imidazole-2-carboxamide::US10266526, Compound 927
SMILES Clc1ccc(Cn2cc(CN3CC(C3)NC(=O)c3nc(c[nH]3)C3CC3)cn2)cc1
InChI Key InChIKey=FAONROFAUHXDEW-UHFFFAOYSA-N
Data  1 IC50
  Tab Delimited (TSV)   2D SDfile   Computed 3D by Vconf -m prep SDfile
Find this compound or compounds like it in BindingDB:
Activity Spreadsheet -- Enzyme Inhibition Constant Data from BindingDB
Found 1 hit for monomerid = 378744
TargetN-lysine methyltransferase SMYD2(Homo sapiens (Human))
Epizyme
US Patent
LigandPNGBDBM378744(N-(1-((1-(4-chlorobenzyl)-1H-pyrazol-4-yl)methyl)a...)
Affinity DataIC50:  11nM. Assay description: The assays were all performed in a buffer consisting of 20 mM Bicine (pH=7.6), 1 mM TCEP, 0.005% Bovine Skin Gelatin, and 0.002% Tween20, prepared on...
Ligand InfoPC cidPC sid
In DepthDetails US Patent