BDBM378946 2-[1-(2-chloro- 4,5- dimethylbenzyl)- 1H-indazol-3-yl]- 5-methoxy-N- (pyridin-4- yl)pyrimidin-4- amine::US10266548, Example 2-3-1
SMILES COc1cnc(nc1Nc1ccncc1)-c1nn(Cc2cc(C)c(C)cc2Cl)c2ccccc12
InChI Key InChIKey=YAAVWYIZLHIKKG-UHFFFAOYSA-N
Data  1 IC50
  Tab Delimited (TSV)   2D SDfile   Computed 3D by Vconf -m prep SDfile
Find this compound or compounds like it in BindingDB:
Activity Spreadsheet -- Enzyme Inhibition Constant Data from BindingDB
Found 1 hit for monomerid = 378946
TargetMitotic checkpoint serine/threonine-protein kinase BUB1(Homo sapiens (Human))
Bayer Intellectual Property
US Patent
LigandPNGBDBM378946(2-[1-(2-chloro- 4,5- dimethylbenzyl)- 1H-indazol-3...)
Affinity DataIC50:  4.40nM. Assay description: Bub1-inhibitory activities of compounds described in the present invention were quantified using a time-resolved fluorescence energy transfer (TR-FRE...
Ligand InfoPC cidPC sid
In DepthDetails US Patent