BDBM379049 Preparation of 2-[1-(4-ethoxy-2,6-difluorobenzyl)-1H-indazol-3-yl]-5-methoxy-N-(pyridin-4-yl)pyrimidin-4-amine hydrochloride (1:1)::US10266548, Example 15-1
SMILES CCOc1cc(F)c(Cn2nc(-c3ncc(OC)c(Nc4ccncc4)n3)c3ccccc23)c(F)c1
InChI Key InChIKey=XLJLAZDKCHDNJX-UHFFFAOYSA-N
Data  1 IC50
  Tab Delimited (TSV)   2D SDfile   Computed 3D by Vconf -m prep SDfile
Find this compound or compounds like it in BindingDB:
Activity Spreadsheet -- Enzyme Inhibition Constant Data from BindingDB
Found 1 hit for monomerid = 379049
TargetMitotic checkpoint serine/threonine-protein kinase BUB1(Homo sapiens (Human))
Bayer Intellectual Property
US Patent
LigandPNGBDBM379049(Preparation of 2-[1-(4-ethoxy-2,6-difluorobenzyl)-...)
Affinity DataIC50:  5.20nM. Assay description: Bub1-inhibitory activities of compounds described in the present invention were quantified using a time-resolved fluorescence energy transfer (TR-FRE...
Ligand InfoPC cidPC sid
In DepthDetails US Patent