BDBM37963 2-(2-((2-((4-(((1,1,1,3,3,3-Hexafluoropropan-2- yl)oxy)carbonyl)piperazin-1-yl)methyl)-5- (trifluoromethyl)phenyl)amino)ethoxy)acetic acid::US10093635, Example 9
SMILES OC(=O)COCCNc1cc(ccc1CN1CCN(CC1)C(=O)OC(C(F)(F)F)C(F)(F)F)C(F)(F)F
InChI Key InChIKey=MBLVCNOEBHFLLS-UHFFFAOYSA-N
Data  1 IC50
  Tab Delimited (TSV)   2D SDfile   Computed 3D by Vconf -m prep SDfile
Find this compound or compounds like it in BindingDB:
Activity Spreadsheet -- Enzyme Inhibition Constant Data from BindingDB
Found 1 hit for monomerid = 37963
TargetMonoglyceride lipase(Homo sapiens (Human))
Abide Therapeutics
US Patent
LigandPNGBDBM37963(2-(2-((2-((4-(((1,1,1,3,3,3-Hexafluoropropan-2- yl...)
Affinity DataIC50:  5.50E+3nMT: 2°C. Assay description: Proteomes (human prefrontal cortex or cell membrane fractions) (50 μL, 1.0-2.0 mg/mL total protein concentration) were preincubated with varying...
In DepthDetails US Patent