BDBM37986 1-((3-((4-(((1,1,1,3,3,3-hexafluoropropan-2- yl)oxy)carbonyl)piperazin-1-yl)methyl)-5- (trifluoromethyl)phenoxy)methyl) cyclopropane-1-carboxylic acid::US10093635, Example 28
SMILES OC(=O)C1(COc2cc(CN3CCN(CC3)C(=O)OC(C(F)(F)F)C(F)(F)F)cc(c2)C(F)(F)F)CC1
InChI Key InChIKey=RAUNTNYNYHVWLH-UHFFFAOYSA-N
Data  1 IC50
  Tab Delimited (TSV)   2D SDfile   Computed 3D by Vconf -m prep SDfile
Find this compound or compounds like it in BindingDB:
Activity Spreadsheet -- Enzyme Inhibition Constant Data from BindingDB
Found 1 hit for monomerid = 37986
TargetMonoglyceride lipase(Homo sapiens (Human))
Abide Therapeutics
US Patent
LigandPNGBDBM37986(1-((3-((4-(((1,1,1,3,3,3-hexafluoropropan-2- yl)ox...)
Affinity DataIC50:  5.50E+3nMT: 2°C. Assay description: Proteomes (human prefrontal cortex or cell membrane fractions) (50 μL, 1.0-2.0 mg/mL total protein concentration) were preincubated with varying...
Ligand InfoPC cidPC sid
In DepthDetails US Patent