BDBM387077 4-(4-(1-(4-(Difluoromethoxy)phenyl)-7-oxo-3-(trifluoromethyl)-4,5-dihydro-1H-pyrazolo[3,4-c]pyridin-6(7H)-yl)piperidin-1-yl)morpholin-3-one::US9938272, Example 23
SMILES FC(F)Oc1ccc(cc1)-n1nc(c2CCN(C3CCN(CC3)N3CCOCC3=O)C(=O)c12)C(F)(F)F
InChI Key InChIKey=RUXRRTKJRVWWCG-UHFFFAOYSA-N
Data  5 KI
  Tab Delimited (TSV)   2D SDfile   Computed 3D by Vconf -m prep SDfile
Find this compound or compounds like it in BindingDB:
Activity Spreadsheet -- Enzyme Inhibition Constant Data from BindingDB
Found 5 hits for monomerid = 387077
TargetCoagulation factor X(Homo sapiens (Human))
North China Pharmaceutical
US Patent
LigandPNGBDBM387077(4-(4-(1-(4-(Difluoromethoxy)phenyl)-7-oxo-3-(trifl...)
Affinity DataKi: <10nM. Assay description: Factor Xa (human or rat): In the assay for measuring the inhibition of human or rat factor Xa activity, Tris-HCl buffer (50 mM, pH 8.3, 150 mM NaCl) ...
Ligand InfoPC cidPC sid
In DepthDetails US Patent
TargetCoagulation factor V/Coagulation factor X/Serine/threonine-protein kinase BRSK2(Homo sapiens (Human))
North China Pharmaceutical
US Patent
LigandPNGBDBM387077(4-(4-(1-(4-(Difluoromethoxy)phenyl)-7-oxo-3-(trifl...)
Affinity DataKi: <10nM. Assay description: Prothrombinase Assay:The effect of test compounds on prothrombinase activity is measured via thrombin generation. Briefly, 12.5 μL human factor ...
Ligand InfoPC cidPC sid
In DepthDetails US Patent
TargetCoagulation factor X(Rattus norvegicus (rat))
North China Pharmaceutical
US Patent
LigandPNGBDBM387077(4-(4-(1-(4-(Difluoromethoxy)phenyl)-7-oxo-3-(trifl...)
Affinity DataKi:  30nM. Assay description: Factor Xa (human or rat): In the assay for measuring the inhibition of human or rat factor Xa activity, Tris-HCl buffer (50 mM, pH 8.3, 150 mM NaCl) ...
Ligand InfoPC cidPC sid
In DepthDetails US Patent
TargetSerine protease 1(Homo sapiens (Human))
North China Pharmaceutical
US Patent
LigandPNGBDBM387077(4-(4-(1-(4-(Difluoromethoxy)phenyl)-7-oxo-3-(trifl...)
Affinity DataKi: >1.00E+3nM. Assay description: Trypsin: In the assay for measuring the inhibition of human trypsin activity buffer (50 mM Tris, pH 8.2, and 20 mM CaCl2) is used. The IC50 is measur...
Ligand InfoPC cidPC sid
In DepthDetails US Patent
TargetProthrombin(Homo sapiens (Human))
North China Pharmaceutical
US Patent
LigandPNGBDBM387077(4-(4-(1-(4-(Difluoromethoxy)phenyl)-7-oxo-3-(trifl...)
Affinity DataKi: >1.00E+3nM. Assay description: Thrombin: In the assay for measuring the inhibition of human thrombin activity buffer (10 mM HEPES buffer, pH 7.4, 2 mM CaCl2) is used. The IC50 is m...
Ligand InfoPC cidPC sid
In DepthDetails US Patent