BDBM395252 (4aS,5aS or 4aR,5aR)-3-(Phenylamino)-2-(pyridin-4-yl)-4a,5,5a,6-tetrahydrocyclopropa[f]indol-4(1H)-one::US10308629, Example 14
SMILES O=C1[C@H]2C[C@H]2Cc2[nH]c(c(Nc3ccccc3)c12)-c1ccncc1
InChI Key
Data  1 IC50
  Tab Delimited (TSV)   2D SDfile   Computed 3D by Vconf -m prep SDfile
Find this compound or compounds like it in BindingDB:
Activity Spreadsheet -- Enzyme Inhibition Constant Data from BindingDB
Found 1 hit for monomerid = 395252
TargetMitotic checkpoint serine/threonine-protein kinase BUB1(Homo sapiens (Human))
Bayer Pharma Aktiengesellschaft
US Patent
LigandPNGBDBM395252((4aS,5aS or 4aR,5aR)-3-(Phenylamino)-2-(pyridin-4-...)
Affinity DataIC50:  4nM. Assay description: Bub1-inhibitory activities of compounds described in the present invention were quantified using a time-resolved fluorescence energy transfer (TR-FRE...
Ligand InfoPC cidPC sid
In DepthDetails US Patent