BDBM399243 US10323029, Generic formula 52527 IB::US11034691, CYM generic formula 52527 IB
SMILES Clc1ccc(nc1)[C@@H](NC(=O)c1ccc(C#N)c(Br)c1)c1ccc(Cl)c(Cl)c1
InChI Key InChIKey=XOLPRYJQLCWVOK-IBGZPJMESA-N
Data  4 IC50
  Tab Delimited (TSV)   2D SDfile   Computed 3D by Vconf -m prep SDfile
Find this compound or compounds like it in BindingDB:
Activity Spreadsheet -- Enzyme Inhibition Constant Data from BindingDB
Found 4 hits for monomerid = 399243
TargetSphingosine 1-phosphate receptor 1(Homo sapiens (Human))
The Scripps Research Institute
US Patent
LigandPNGBDBM399243(US10323029, Generic formula 52527 IB | US11034691,...)
Affinity DataIC50:  204nM. Assay description: TBD
Ligand InfoPC cidPC sid
In DepthDetails US Patent
TargetSphingosine 1-phosphate receptor 3(Homo sapiens (Human))
The Scripps Research Institute
US Patent
LigandPNGBDBM399243(US10323029, Generic formula 52527 IB | US11034691,...)
Affinity DataIC50:  32nM. Assay description: Ligand competition binding was used.
Ligand InfoPC cidPC sid
In DepthDetails US Patent
TargetSphingosine 1-phosphate receptor 1(Homo sapiens (Human))
The Scripps Research Institute
US Patent
LigandPNGBDBM399243(US10323029, Generic formula 52527 IB | US11034691,...)
Affinity DataIC50:  204nM. Assay description: Ligand competition binding was used.
Ligand InfoPC cidPC sid
In DepthDetails US Patent
TargetSphingosine 1-phosphate receptor 3(Homo sapiens (Human))
The Scripps Research Institute
US Patent
LigandPNGBDBM399243(US10323029, Generic formula 52527 IB | US11034691,...)
Affinity DataIC50:  32nM. Assay description: TBD
Ligand InfoPC cidPC sid
In DepthDetails US Patent