BDBM399272 US10323029, Generic formula 52577 IB::US11034691, CYM generic formula 52577 IB
SMILES Fc1cc(ccc1C#N)C(=O)N[C@@H](c1ccc(Cl)cc1)c1ccc(Br)cn1
InChI Key InChIKey=VNGCQRCFJJMJQT-IBGZPJMESA-N
Data  8 IC50
  Tab Delimited (TSV)   2D SDfile   Computed 3D by Vconf -m prep SDfile
Find this compound or compounds like it in BindingDB:
Activity Spreadsheet -- Enzyme Inhibition Constant Data from BindingDB
Found 8 hits for monomerid = 399272
TargetSphingosine 1-phosphate receptor 1(Homo sapiens (Human))
The Scripps Research Institute
US Patent
LigandPNGBDBM399272(US10323029, Generic formula 52577 IB | US11034691,...)
Affinity DataIC50: >2.80E+4nM. Assay description: TBD
Ligand InfoPC cidPC sid
In DepthDetails US Patent
TargetSphingosine 1-phosphate receptor 2(Homo sapiens (Human))
The Scripps Research Institute
US Patent
LigandPNGBDBM399272(US10323029, Generic formula 52577 IB | US11034691,...)
Affinity DataIC50: >5.00E+4nM. Assay description: TBD
Ligand InfoPC cidPC sid
In DepthDetails US Patent
TargetSphingosine 1-phosphate receptor 3(Homo sapiens (Human))
The Scripps Research Institute
US Patent
LigandPNGBDBM399272(US10323029, Generic formula 52577 IB | US11034691,...)
Affinity DataIC50:  26nM. Assay description: TBD
Ligand InfoPC cidPC sid
In DepthDetails US Patent
TargetSphingosine 1-phosphate receptor 4(Homo sapiens (Human))
The Scripps Research Institute
US Patent
LigandPNGBDBM399272(US10323029, Generic formula 52577 IB | US11034691,...)
Affinity DataIC50: >5.00E+4nM. Assay description: Ligand competition binding was used.
Ligand InfoPC cidPC sid
In DepthDetails US Patent
TargetSphingosine 1-phosphate receptor 1(Homo sapiens (Human))
The Scripps Research Institute
US Patent
LigandPNGBDBM399272(US10323029, Generic formula 52577 IB | US11034691,...)
Affinity DataIC50: >2.80E+4nM. Assay description: Ligand competition binding was used.
Ligand InfoPC cidPC sid
In DepthDetails US Patent
TargetSphingosine 1-phosphate receptor 2(Homo sapiens (Human))
The Scripps Research Institute
US Patent
LigandPNGBDBM399272(US10323029, Generic formula 52577 IB | US11034691,...)
Affinity DataIC50: >5.00E+4nM. Assay description: Ligand competition binding was used.
Ligand InfoPC cidPC sid
In DepthDetails US Patent
TargetSphingosine 1-phosphate receptor 3(Homo sapiens (Human))
The Scripps Research Institute
US Patent
LigandPNGBDBM399272(US10323029, Generic formula 52577 IB | US11034691,...)
Affinity DataIC50:  26nM. Assay description: Ligand competition binding was used.
Ligand InfoPC cidPC sid
In DepthDetails US Patent
TargetSphingosine 1-phosphate receptor 4(Homo sapiens (Human))
The Scripps Research Institute
US Patent
LigandPNGBDBM399272(US10323029, Generic formula 52577 IB | US11034691,...)
Affinity DataIC50: >5.00E+4nM. Assay description: TBD
Ligand InfoPC cidPC sid
In DepthDetails US Patent