BDBM399325 US10323029, Generic formula 52633 IB::US11034691, CYM generic formula 52633 IB
SMILES Cc1cc(Br)cnc1[C@@H](NC(=O)c1ccc(C#N)c(F)c1)c1ccc(Cl)c(F)c1
InChI Key InChIKey=WSLLAWBVTDAMEU-FQEVSTJZSA-N
Data  4 IC50
  Tab Delimited (TSV)   2D SDfile   Computed 3D by Vconf -m prep SDfile
Find this compound or compounds like it in BindingDB:
Activity Spreadsheet -- Enzyme Inhibition Constant Data from BindingDB
Found 4 hits for monomerid = 399325
TargetSphingosine 1-phosphate receptor 1(Homo sapiens (Human))
The Scripps Research Institute
US Patent
LigandPNGBDBM399325(US10323029, Generic formula 52633 IB | US11034691,...)
Affinity DataIC50:  1.60E+3nM. Assay description: TBD
Ligand InfoPC cidPC sid
In DepthDetails US Patent
TargetSphingosine 1-phosphate receptor 3(Homo sapiens (Human))
The Scripps Research Institute
US Patent
LigandPNGBDBM399325(US10323029, Generic formula 52633 IB | US11034691,...)
Affinity DataIC50:  26nM. Assay description: Ligand competition binding was used.
Ligand InfoPC cidPC sid
In DepthDetails US Patent
TargetSphingosine 1-phosphate receptor 1(Homo sapiens (Human))
The Scripps Research Institute
US Patent
LigandPNGBDBM399325(US10323029, Generic formula 52633 IB | US11034691,...)
Affinity DataIC50:  1.60E+3nM. Assay description: Ligand competition binding was used.
Ligand InfoPC cidPC sid
In DepthDetails US Patent
TargetSphingosine 1-phosphate receptor 3(Homo sapiens (Human))
The Scripps Research Institute
US Patent
LigandPNGBDBM399325(US10323029, Generic formula 52633 IB | US11034691,...)
Affinity DataIC50:  26nM. Assay description: TBD
Ligand InfoPC cidPC sid
In DepthDetails US Patent