BDBM40113 3-(2-chlorophenyl)-5-methyl-N-(3-pyridinylmethyl)-4-isoxazolecarboxamide::3-(2-chlorophenyl)-5-methyl-N-(3-pyridylmethyl)isoxazole-4-carboxamide::3-(2-chlorophenyl)-5-methyl-N-(pyridin-3-ylmethyl)-1,2-oxazole-4-carboxamide::MLS000106769::SMR000111145::cid_626045
SMILES Cc1onc(c1C(=O)NCc1cccnc1)-c1ccccc1Cl
InChI Key InChIKey=MAMXMFXRLGXJEW-UHFFFAOYSA-N
Data  1 IC50
  Tab Delimited (TSV)   2D SDfile   Computed 3D by Vconf -m prep SDfile
Find this compound or compounds like it in BindingDB:
Activity Spreadsheet -- Enzyme Inhibition Constant Data from BindingDB
Found 1 hit for monomerid = 40113
TargetEstrogen receptor(Homo sapiens (Human))
Emory University
Curated by PubChem BioAssay
LigandPNGBDBM40113(3-(2-chlorophenyl)-5-methyl-N-(3-pyridinylmethyl)-...)
Affinity DataIC50: >5.00E+4nM. Assay description: NIH Molecular Libraries Screening Centers Network [MLSCN] Emory Chemical Biology Discovery Center in MLSCN Assay provider: John A. Katzenellenbogen, ...
In DepthDetails PCBioAssay