BDBM40115 (4Z)-2-(allylthio)-4-[(E)-3-(2-furyl)prop-2-enylidene]-2-thiazolin-5-one::(4Z)-4-[(E)-3-(2-furanyl)prop-2-enylidene]-2-(prop-2-enylthio)-5-thiazolone::(4Z)-4-[(E)-3-(furan-2-yl)prop-2-enylidene]-2-prop-2-enylsulfanyl-1,3-thiazol-5-one::MLS000113126::SMR000109033::cid_2296726
SMILES C=CCSC1=N\C(=C/C=C/c2ccco2)C(=O)S1
InChI Key InChIKey=CPXSSTSRVQBMDA-PGACXJNKSA-N
Data  6 IC50
  Tab Delimited (TSV)   2D SDfile   Computed 3D by Vconf -m prep SDfile
Find this compound or compounds like it in BindingDB:
Activity Spreadsheet -- Enzyme Inhibition Constant Data from BindingDB
Found 6 hits for monomerid = 40115
TargetEstrogen receptor(Homo sapiens (Human))
Emory University
Curated by PubChem BioAssay
LigandPNGBDBM40115((4Z)-2-(allylthio)-4-[(E)-3-(2-furyl)prop-2-enylid...)
Affinity DataIC50: >5.00E+4nM. Assay description: NIH Molecular Libraries Screening Centers Network [MLSCN] Emory Chemical Biology Discovery Center in MLSCN Assay provider: John A. Katzenellenbogen, ...
In DepthDetails PCBioAssay
TargetInduced myeloid leukemia cell differentiation protein Mcl-1(Homo sapiens (Human))
Emory University
Curated by PubChem BioAssay
LigandPNGBDBM40115((4Z)-2-(allylthio)-4-[(E)-3-(2-furyl)prop-2-enylid...)
Affinity DataIC50:  5.61E+3nM. Assay description: NIH Molecular Libraries Screening Centers Network [MLSCN] Emory Chemical Biology Discovery Center in MLSCN Assay provider: Nikolovska-Coleska, Univer...
In DepthDetails PCBioAssay
TargetHuntingtin(Homo sapiens (Human))
The Scripps Research Institute Molecular Screening Center
Curated by PubChem BioAssay
LigandPNGBDBM40115((4Z)-2-(allylthio)-4-[(E)-3-(2-furyl)prop-2-enylid...)
Affinity DataIC50:  6.70E+3nM
In DepthDetails PCBioAssay
TargetEstrogen receptor beta(Homo sapiens (Human))
Emory University
Curated by PubChem BioAssay
LigandPNGBDBM40115((4Z)-2-(allylthio)-4-[(E)-3-(2-furyl)prop-2-enylid...)
Affinity DataIC50:  1.03E+4nM. Assay description: NIH Molecular Libraries Screening Centers Network [MLSCN] Emory Chemical Biology Discovery Center in MLSCN Assay provider: John A. Katzenellenbogen, ...
In DepthDetails PCBioAssay
TargetGenome polyprotein(Hepatitis C virus)
The Scripps Research Institute Molecular Screening Center
Curated by PubChem BioAssay
LigandPNGBDBM40115((4Z)-2-(allylthio)-4-[(E)-3-(2-furyl)prop-2-enylid...)
Affinity DataIC50:  1.10E+4nM. Assay description: Source (MLPCN Center Name): The Scripps Research Institute Molecular Screening Center (SRIMSC) Center Affiliation: The Scripps Research Institute (TS...
In DepthDetails PCBioAssay
TargetEstrogen receptor beta(Homo sapiens (Human))
Emory University
Curated by PubChem BioAssay
LigandPNGBDBM40115((4Z)-2-(allylthio)-4-[(E)-3-(2-furyl)prop-2-enylid...)
Affinity DataIC50:  5.00E+4nM. Assay description: NIH Molecular Libraries Screening Centers Network [MLSCN] Emory Chemical Biology Discovery Center in MLSCN Assay provider: John A. Katzenellenbogen, ...
In DepthDetails PCBioAssay