BDBM4018 2-{[1,4-dimethyl-3-(phenylcarbamoyl)-1H-indol-2-yl]disulfanyl}-1,4-dimethyl-N-phenyl-1H-indole-3-carboxamide::dithiobis(1H-indole-3-carboxamide) deriv. 10c
SMILES Cc1cccc2n(C)c(SSc3c(C(=O)Nc4ccccc4)c4c(C)cccc4n3C)c(C(=O)Nc3ccccc3)c12
InChI Key InChIKey=LDDNNZKKMXSXPS-UHFFFAOYSA-N
Data  2 IC50
  Tab Delimited (TSV)   2D SDfile   Computed 3D by Vconf -m prep SDfile
Find this compound or compounds like it in BindingDB:
Activity Spreadsheet -- Enzyme Inhibition Constant Data from BindingDB
Found 2 hits for monomerid = 4018
TargetTyrosine-protein kinase transforming protein Src(Avian sarcoma virus)
University Of Auckland
LigandPNGBDBM4018(2-{[1,4-dimethyl-3-(phenylcarbamoyl)-1H-indol-2-yl...)
Affinity DataIC50: >1.00E+5nMpH: 7.5 T: 2°C. Assay description: IC50 is the inhibitor concentration which inhibits 50% of kinase activity that catalyzes the transfer of the terminal phosphate from [gamma-32P] labe...
In DepthDetails ArticlePubMed
TargetEpidermal growth factor receptor(Homo sapiens (Human))
University Of Auckland
LigandPNGBDBM4018(2-{[1,4-dimethyl-3-(phenylcarbamoyl)-1H-indol-2-yl...)
Affinity DataIC50: >1.00E+5nMpH: 7.4 T: 2°C. Assay description: IC50 is the inhibitor concentration which inhibits 50% of kinase activity that catalyzes the transfer of the terminal phosphate from [gamma-32P] labe...
In DepthDetails ArticlePubMed