BDBM40680 2-(7-chloranyl-2-oxidanylidene-5-phenyl-3H-1,4-benzodiazepin-1-yl)-N-[4-(dimethylamino)phenyl]ethanamide::2-(7-chloro-2-keto-5-phenyl-3H-1,4-benzodiazepin-1-yl)-N-[4-(dimethylamino)phenyl]acetamide::2-(7-chloro-2-oxo-5-phenyl-3H-1,4-benzodiazepin-1-yl)-N-[4-(dimethylamino)phenyl]acetamide::MLS000522831::SMR000128097::cid_4067095
SMILES CN(C)c1ccc(NC(=O)CN2c3ccc(Cl)cc3C(=NCC2=O)c2ccccc2)cc1
InChI Key InChIKey=ITHTVAOJVIPHQM-UHFFFAOYSA-N
Data  2 IC50  1 EC50
  Tab Delimited (TSV)   2D SDfile   Computed 3D by Vconf -m prep SDfile
Find this compound or compounds like it in BindingDB:
Activity Spreadsheet -- Enzyme Inhibition Constant Data from BindingDB
Found 3 hits for monomerid = 40680
TargetNuclear receptor subfamily 4 group A member 1(Homo sapiens (Human))
Burnham Center For Chemical Genomics
Curated by PubChem BioAssay
LigandPNGBDBM40680(2-(7-chloranyl-2-oxidanylidene-5-phenyl-3H-1,4-ben...)
Affinity DataIC50: >1.00E+5nM. Assay description: Sanford-Burnham Center for Chemical Genomics (SBCCG) Sanford-Burnham Medical Research Institute (San Diego, CA) NIH Molecular Libraries Screening Cen...
In DepthDetails PCBioAssay
TargetInduced myeloid leukemia cell differentiation protein Mcl-1(Homo sapiens (Human))
Emory University
Curated by PubChem BioAssay
LigandPNGBDBM40680(2-(7-chloranyl-2-oxidanylidene-5-phenyl-3H-1,4-ben...)
Affinity DataIC50:  856nM. Assay description: NIH Molecular Libraries Screening Centers Network [MLSCN] Emory Chemical Biology Discovery Center in MLSCN Assay provider: Nikolovska-Coleska, Univer...
In DepthDetails PCBioAssay
TargetMultidrug resistance-associated protein 1(Homo sapiens (Human))
Srmlsc
Curated by PubChem BioAssay
LigandPNGBDBM40680(2-(7-chloranyl-2-oxidanylidene-5-phenyl-3H-1,4-ben...)
Affinity DataEC50:  6.99E+3nM. Assay description: Southern Research Molecular Libraries Screening Center (SRMLSC) Southern Research Institute (Birmingham, Alabama) NIH Molecular Libraries Screening C...
In DepthDetails PCBioAssay