BDBM408181 N-((2-(4-(1-(benzo[d][1,3]dioxol-5-yl)ethyl)piperazin-1-yl)thiazol-4-yl)methyl)acetamide::US10336775, Example 85::US11046712, No 85
SMILES CC(N1CCN(CC1)c1ncc(CNC(C)=O)s1)c1ccc2OCOc2c1
InChI Key InChIKey=WGXKPHPKOLRLDR-UHFFFAOYSA-N
Data  2 IC50
  Tab Delimited (TSV)   2D SDfile   Computed 3D by Vconf -m prep SDfile
Find this compound or compounds like it in BindingDB:
Activity Spreadsheet -- Enzyme Inhibition Constant Data from BindingDB
Found 2 hits for monomerid = 408181
TargetProtein O-GlcNAcase(Homo sapiens (Human))
Asceneuron
US Patent
LigandPNGBDBM408181(N-((2-(4-(1-(benzo[d][1,3]dioxol-5-yl)ethyl)pipera...)
Affinity DataIC50: <50nM. Assay description: 5 μI of the appropriate concentration of a solution of inhibitor in McIlvaine's Buffer (pH 6.5) in 2% DMSO (for a dose response curve calcul...
Ligand InfoPC cidPC sid
In DepthDetails US Patent
TargetProtein O-GlcNAcase(Homo sapiens (Human))
Asceneuron
US Patent
LigandPNGBDBM408181(N-((2-(4-(1-(benzo[d][1,3]dioxol-5-yl)ethyl)pipera...)
Affinity DataIC50: <50nM. Assay description: 5 μl of the appropriate concentration of a solution of inhibitor in McIlvaine's Buffer (pH 6.5) in 2% DMSO (for a dose response curve calcul...
Ligand InfoPC cidPC sid
In DepthDetails US Patent