BDBM408220 N-(5-(4-(1-(benzo[c][1,2,5]thiadiazol-5-yl)ethyl)piperazin-1-yl)-1,3,4-thiadiazol-2-yl)acetamide::US10336775, Example 124::US11046712, No 124
SMILES CC(N1CCN(CC1)c1nnc(NC(C)=O)s1)c1ccc2cc(Cl)cnc2c1
InChI Key InChIKey=FXIUQIORFKGLTE-UHFFFAOYSA-N
Data  2 IC50
  Tab Delimited (TSV)   2D SDfile   Computed 3D by Vconf -m prep SDfile
Find this compound or compounds like it in BindingDB:
Activity Spreadsheet -- Enzyme Inhibition Constant Data from BindingDB
Found 2 hits for monomerid = 408220
TargetProtein O-GlcNAcase(Homo sapiens (Human))
Asceneuron
US Patent
LigandPNGBDBM408220(N-(5-(4-(1-(benzo[c][1,2,5]thiadiazol-5-yl)ethyl)p...)
Affinity DataIC50:  5.50E+3nM. Assay description: 5 μI of the appropriate concentration of a solution of inhibitor in McIlvaine's Buffer (pH 6.5) in 2% DMSO (for a dose response curve calcul...
Ligand InfoPC cidPC sid
In DepthDetails US Patent
TargetProtein O-GlcNAcase(Homo sapiens (Human))
Asceneuron
US Patent
LigandPNGBDBM408220(N-(5-(4-(1-(benzo[c][1,2,5]thiadiazol-5-yl)ethyl)p...)
Affinity DataIC50:  5.50E+3nM. Assay description: 5 μl of the appropriate concentration of a solution of inhibitor in McIlvaine's Buffer (pH 6.5) in 2% DMSO (for a dose response curve calcul...
Ligand InfoPC cidPC sid
In DepthDetails US Patent