BDBM408745 N-[(2-fluoro-4-methylphenyl)methyl]-3-(methoxymethyl)-1-({4-[(2-oxopyridin-1- yl)methyl]phenyl}methyl)pyrazole-4-carboxamide ::US10364238, Example 65::US11001578, Example 65::US11084809, Example 65::US11198691, Example 65
SMILES COCc1nn(Cc2ccc(Cn3ccccc3=O)cc2)cc1C(=O)NCc1ccc(C)cc1F
InChI Key InChIKey=XRBNFAVKAJTXOR-UHFFFAOYSA-N
Data  8 IC50
  Tab Delimited (TSV)   2D SDfile   Computed 3D by Vconf -m prep SDfile
Find this compound or compounds like it in BindingDB:
Activity Spreadsheet -- Enzyme Inhibition Constant Data from BindingDB
Found 8 hits for monomerid = 408745
TargetPlasma kallikrein(Homo sapiens (Human))
Kalvista Pharmaceuticals
US Patent
LigandPNGBDBM408745( N-[(2-fluoro-4-methylphenyl)methyl]-3-(methoxymet...)
Affinity DataIC50:  43.3nM. Assay description: Plasma kallikrein inhibitory activity in vitro was determined using standard published methods. Human plasma kallikrein (Protogen) was incubated at 2...
Ligand InfoPC cidPC sid
In DepthDetails US Patent
TargetKallikrein-1(Homo sapiens (Human))
Kalvista Pharmaceuticals
US Patent
LigandPNGBDBM408745( N-[(2-fluoro-4-methylphenyl)methyl]-3-(methoxymet...)
Affinity DataIC50: >1.00E+4nM. Assay description: KLK1 inhibitory activity in vitro was determined using standard published methods. Human KLK1 (Callbiochem) was incubated at 25° C. with the fluorog...
Ligand InfoPC cidPC sid
In DepthDetails US Patent
TargetPlasma kallikrein(Homo sapiens (Human))
Kalvista Pharmaceuticals
US Patent
LigandPNGBDBM408745( N-[(2-fluoro-4-methylphenyl)methyl]-3-(methoxymet...)
Affinity DataIC50:  43.3nM. Assay description: Plasma kallikrein inhibitory activity in vitro was determined using standard published methods (see e.g. Johansen et al., Int. J. Tiss. Reac. 1986, 8...
Ligand InfoPC cidPC sid
In DepthDetails US Patent
TargetKallikrein-1(Homo sapiens (Human))
Kalvista Pharmaceuticals
US Patent
LigandPNGBDBM408745( N-[(2-fluoro-4-methylphenyl)methyl]-3-(methoxymet...)
Affinity DataIC50: >1.00E+4nM. Assay description: Plasma kallikrein inhibitory activity in vitro was determined using standard published methods. Human plasma kallikrein (Protogen) was incubated at 2...
Ligand InfoPC cidPC sid
In DepthDetails US Patent
TargetPlasma kallikrein(Homo sapiens (Human))
Kalvista Pharmaceuticals
US Patent
LigandPNGBDBM408745( N-[(2-fluoro-4-methylphenyl)methyl]-3-(methoxymet...)
Affinity DataIC50:  43.3nM. Assay description: Plasma kallikrein inhibitory activity in vitro was determined using standard published methods (see e.g. Johansen et al., Int. J. Tiss. Reac. 1986, 8...
Ligand InfoPC cidPC sid
In DepthDetails US Patent
TargetKallikrein-1(Homo sapiens (Human))
Kalvista Pharmaceuticals
US Patent
LigandPNGBDBM408745( N-[(2-fluoro-4-methylphenyl)methyl]-3-(methoxymet...)
Affinity DataIC50: >1.00E+4nM. Assay description: KLK1 inhibitory activity in vitro was determined using standard published methods (see e.g. Johansen et al., Int. J. Tiss. Reac. 1986, 8, 185; Shori ...
Ligand InfoPC cidPC sid
In DepthDetails US Patent
TargetPlasma kallikrein(Homo sapiens (Human))
Kalvista Pharmaceuticals
US Patent
LigandPNGBDBM408745( N-[(2-fluoro-4-methylphenyl)methyl]-3-(methoxymet...)
Affinity DataIC50:  43.3nM. Assay description: KLK1 inhibitory activity in vitro was determined using standard published methods. Human KLK1 (Callbiochem) was incubated at 25° C. with the fluoroge...
Ligand InfoPC cidPC sid
In DepthDetails US Patent
TargetKallikrein-1(Homo sapiens (Human))
Kalvista Pharmaceuticals
US Patent
LigandPNGBDBM408745( N-[(2-fluoro-4-methylphenyl)methyl]-3-(methoxymet...)
Affinity DataIC50: >1.00E+4nM. Assay description: KLK1 inhibitory activity in vitro was determined using standard published methods (see e.g. Johansen et al., Int. J. Tiss. Reac. 1986, 8, 185; Shori ...
Ligand InfoPC cidPC sid
In DepthDetails US Patent