BDBM412755 N-(4-((2-(6-(trifluoromethyl)pyridin-2-yl)-7H-pyrrolo[2,3-d]pyrimidin-4-yl)amino)pyridin-2-yl)acetamide::US10399987, Example 20
SMILES CC(=O)Nc1cc(Nc2nc(nc3[nH]ccc23)-c2cccc(n2)C(F)(F)F)ccn1
InChI Key InChIKey=HCZOMSNBQCWQJO-UHFFFAOYSA-N
Data  1 KI  5 IC50
  Tab Delimited (TSV)   2D SDfile   Computed 3D by Vconf -m prep SDfile
Find this compound or compounds like it in BindingDB:
Activity Spreadsheet -- Enzyme Inhibition Constant Data from BindingDB
Found 6 hits for monomerid = 412755
TargetTGF-beta receptor type-1(Homo sapiens (Human))
Bristol-Myers Squibb
Curated by ChEMBL
LigandPNGBDBM412755(N-(4-((2-(6-(trifluoromethyl)pyridin-2-yl)-7H-pyrr...)
Affinity DataKi:  0.150nM. Assay description: Inhibition of human His-tagged TGFbetaR1 T204D mutant expressed in Sf9 insect cells after 1 hr by HTRF assay
Ligand Info
In DepthDetails ArticlePubMed
TargetTGF-beta receptor type-1(Homo sapiens (Human))
Bristol-Myers Squibb
Curated by ChEMBL
LigandPNGBDBM412755(N-(4-((2-(6-(trifluoromethyl)pyridin-2-yl)-7H-pyrr...)
Affinity DataIC50:  1nM. Assay description: Inhibition of human His-tagged TGFbetaR1 T204D mutant expressed in Sf9 insect cells after 1 hr by HTRF assay
Ligand Info
In DepthDetails ArticlePubMed
TargetTGF-beta receptor type-2(Homo sapiens (Human))
Bristol-Myer Squibb
US Patent
LigandPNGBDBM412755(N-(4-((2-(6-(trifluoromethyl)pyridin-2-yl)-7H-pyrr...)
Affinity DataIC50:  5.00E+3nM. Assay description: Assays are conducted in 1536-well plates and 2 mL reactions are prepared from addition of HIS-TGFβR1 T204D or HIS-TGFβR2 WT, anti-HIS detec...
Ligand Info
In DepthDetails US Patent
TargetTGF-beta receptor type-1 [4-503,T204D](Homo sapiens (Human))
Bristol-Myer Squibb
US Patent
LigandPNGBDBM412755(N-(4-((2-(6-(trifluoromethyl)pyridin-2-yl)-7H-pyrr...)
Affinity DataIC50:  0.670nM. Assay description: Assays are conducted in 1536-well plates and 2 mL reactions are prepared from addition of HIS-TGFβR1 T204D or HIS-TGFβR2 WT, anti-HIS detec...
Ligand Info
In DepthDetails US Patent
TargetTGF-beta receptor type-2(Homo sapiens (Human))
Bristol-Myer Squibb
US Patent
LigandPNGBDBM412755(N-(4-((2-(6-(trifluoromethyl)pyridin-2-yl)-7H-pyrr...)
Affinity DataIC50:  940nM. Assay description: Inhibition of wild type His-tagged TGFbetaR2 (unknown origin) after 1 hr by HTRF assay
Ligand Info
In DepthDetails ArticlePubMed
TargetTGF-beta receptor type-1(Homo sapiens (Human))
Bristol-Myers Squibb
Curated by ChEMBL
LigandPNGBDBM412755(N-(4-((2-(6-(trifluoromethyl)pyridin-2-yl)-7H-pyrr...)
Affinity DataIC50:  12nM. Assay description: Inhibition of TGFbetaR1 in human primary T-cells assessed as TGFbeta-stimulated PSMAD phosphorylation preincubated for 1 hr followed by TGFbeta addit...
Ligand Info
In DepthDetails ArticlePubMed