BDBM415117 Intermediate 1-2-46::US10428044, Example 217
SMILES Clc1cc(CNC2=C(C(=S)Nc3ccccc3)C(=O)CCC2)cc(Cl)n1
InChI Key InChIKey=ALVYFYUCHJYKBI-UHFFFAOYSA-N
Data  1 IC50
  Tab Delimited (TSV)   2D SDfile   Computed 3D by Vconf -m prep SDfile
Find this compound or compounds like it in BindingDB:
Activity Spreadsheet -- Enzyme Inhibition Constant Data from BindingDB
Found 1 hit for monomerid = 415117
TargetMitotic checkpoint serine/threonine-protein kinase BUB1(Homo sapiens (Human))
Bayer Pharma Aktiengesellschaft
US Patent
LigandPNGBDBM415117(Intermediate 1-2-46 | US10428044, Example 217)
Affinity DataIC50: >2.00E+4nM. Assay description: In a typical assay 11 different concentrations of each compound (0.1 nM, 0.33 nM, 1.1 nM, 3.8 nM, 13 nM, 44 nM, 0.15 μM, 0.51 μM, 1.7 μ...
Ligand InfoPC cidPC sid
In DepthDetails US Patent