BDBM415317 Preparation of 3-{[2-(hydroxymethyl)phenyl]amino}-6,6-dimethyl-2-(pyridin-4-yl)-1,5,6,7-tetrahydro-4H-indol-4-one::US10428044, Example 426
SMILES CC1(C)Cc2[nH]c(c(Nc3ccccc3CO)c2C(=O)C1)-c1ccncc1
InChI Key InChIKey=KRKRDXOBTXQTPY-UHFFFAOYSA-N
Data  1 IC50
  Tab Delimited (TSV)   2D SDfile   Computed 3D by Vconf -m prep SDfile
Find this compound or compounds like it in BindingDB:
Activity Spreadsheet -- Enzyme Inhibition Constant Data from BindingDB
Found 1 hit for monomerid = 415317
TargetMitotic checkpoint serine/threonine-protein kinase BUB1(Homo sapiens (Human))
Bayer Pharma Aktiengesellschaft
US Patent
LigandPNGBDBM415317(Preparation of 3-{[2-(hydroxymethyl)phenyl]amino}-...)
Affinity DataIC50:  2.58nM. Assay description: In a typical assay 11 different concentrations of each compound (0.1 nM, 0.33 nM, 1.1 nM, 3.8 nM, 13 nM, 44 nM, 0.15 μM, 0.51 μM, 1.7 μ...
Ligand InfoPC cidPC sid
In DepthDetails US Patent