BDBM418075 2-(6-{5-chloro-2-[(oxan-4- yl)amino]pyrimidin-4-yl}-1-oxo-2,3- dihydro-1H-isoindol-2-yl)-N-[(1R)-1-[6- (dimethylamino)pyridin-2- yl]ethyl]acetamide::US10457669, Example 784::US11001575, Example 784
SMILES C[C@@H](NC(=O)CN1Cc2ccc(cc2C1=O)-c1nc(NC2CCOCC2)ncc1Cl)c1cccc(n1)N(C)C
InChI Key InChIKey=ZPXXXPHYBHWJKD-QGZVFWFLSA-N
Data  2 IC50
  Tab Delimited (TSV)   2D SDfile   Computed 3D by Vconf -m prep SDfile
Find this compound or compounds like it in BindingDB:
Activity Spreadsheet -- Enzyme Inhibition Constant Data from BindingDB
Found 2 hits for monomerid = 418075
TargetMitogen-activated protein kinase 1(Homo sapiens (Human))
Otsuka Pharmaceutical
US Patent
LigandPNGBDBM418075(2-(6-{5-chloro-2-[(oxan-4- yl)amino]pyrimidin-4-yl...)
Affinity DataIC50:  2nM. Assay description: Activity of ERK2 enzyme (Life Technologies) was determined using a time-resolved fluorescence format measuring the phosphorylation of a truncated ver...
Ligand InfoPC cidPC sid
In DepthDetails US Patent
TargetMitogen-activated protein kinase 1(Homo sapiens (Human))
Otsuka Pharmaceutical
US Patent
LigandPNGBDBM418075(2-(6-{5-chloro-2-[(oxan-4- yl)amino]pyrimidin-4-yl...)
Affinity DataIC50:  2nM. Assay description: Activity of ERK2 enzyme (Life Technologies) was determined using a time-resolved fluorescence format measuring the phosphorylation of a truncated ver...
Ligand InfoPC cidPC sid
In DepthDetails US Patent