BDBM418144 (2R)-2-(6-{5-chloro-2-[(1H-pyrazol-4- yl)amino]pyrimidin-4-yl}-1-oxo-2,3- dihydro-1H-isoindol-2-yl)-N-[(1S)-1-(3- fluoro-5-methoxyphenyl)-2- hydroxyethyl]propanamide::US10457669, Example 887::US11001575, Example 887
SMILES COc1cc(F)cc(c1)[C@@H](CO)NC(=O)[C@@H](C)N1Cc2ccc(cc2C1=O)-c1nc(Nc2cn[nH]c2)ncc1Cl
InChI Key
Data  2 IC50
  Tab Delimited (TSV)   2D SDfile   Computed 3D by Vconf -m prep SDfile
Find this compound or compounds like it in BindingDB:
Activity Spreadsheet -- Enzyme Inhibition Constant Data from BindingDB
Found 2 hits for monomerid = 418144
TargetMitogen-activated protein kinase 1(Homo sapiens (Human))
Otsuka Pharmaceutical
US Patent
LigandPNGBDBM418144((2R)-2-(6-{5-chloro-2-[(1H-pyrazol-4- yl)amino]pyr...)
Affinity DataIC50:  1.80nM. Assay description: Activity of ERK2 enzyme (Life Technologies) was determined using a time-resolved fluorescence format measuring the phosphorylation of a truncated ver...
Ligand InfoPC cidPC sid
In DepthDetails US Patent
TargetMitogen-activated protein kinase 1(Homo sapiens (Human))
Otsuka Pharmaceutical
US Patent
LigandPNGBDBM418144((2R)-2-(6-{5-chloro-2-[(1H-pyrazol-4- yl)amino]pyr...)
Affinity DataIC50:  1.80nM. Assay description: Activity of ERK2 enzyme (Life Technologies) was determined using a time-resolved fluorescence format measuring the phosphorylation of a truncated ver...
Ligand InfoPC cidPC sid
In DepthDetails US Patent