BDBM418305 (2R)-2-(6-{5-chloro-2-[(2- methylpyrimidin-4-yl)amino]pyrimidin- 4-yl}-1-oxo-2,3-dihydro-1H-isoindol-2- yl)-N-[(1S)-1-[6-(ethylamino)pyridin-2- yl]-2-hydroxyethyl]propanamide::US10457669, Example 1112::US11001575, Example 1112
SMILES CCNc1cccc(n1)[C@@H](CO)NC(=O)[C@@H](C)N1Cc2ccc(cc2C1=O)-c1nc(Nc2ccnc(C)n2)ncc1Cl
InChI Key InChIKey=DUVDFODWVUBLCR-WAIKUNEKSA-N
Data  2 IC50
  Tab Delimited (TSV)   2D SDfile   Computed 3D by Vconf -m prep SDfile
Find this compound or compounds like it in BindingDB:
Activity Spreadsheet -- Enzyme Inhibition Constant Data from BindingDB
Found 2 hits for monomerid = 418305
TargetMitogen-activated protein kinase 1(Homo sapiens (Human))
Otsuka Pharmaceutical
US Patent
LigandPNGBDBM418305((2R)-2-(6-{5-chloro-2-[(2- methylpyrimidin-4-yl)am...)
Affinity DataIC50:  1.5nM. Assay description: Activity of ERK2 enzyme (Life Technologies) was determined using a time-resolved fluorescence format measuring the phosphorylation of a truncated ver...
Ligand InfoPC cidPC sid
In DepthDetails US Patent
TargetMitogen-activated protein kinase 1(Homo sapiens (Human))
Otsuka Pharmaceutical
US Patent
LigandPNGBDBM418305((2R)-2-(6-{5-chloro-2-[(2- methylpyrimidin-4-yl)am...)
Affinity DataIC50:  1.5nM. Assay description: Activity of ERK2 enzyme (Life Technologies) was determined using a time-resolved fluorescence format measuring the phosphorylation of a truncated ver...
Ligand InfoPC cidPC sid
In DepthDetails US Patent