BDBM419218 4-((((1R,5S,6S)-3- oxabicyclo[3.1.0]hexan-6- yl)methyl)amino)-N-(4- ethylphenyl)-N-isobutyl-3- (S- methylsulfonimidoyl)benzene- sulfonamide::US10457637, Compound 91
SMILES CCc1ccc(cc1)N(CC(C)C)S(=O)(=O)c1ccc(NC[C@H]2[C@@H]3COC[C@H]23)c(c1)S(C)(=N)=O
InChI Key InChIKey=PQWNXSKZDKHHGN-SUVDURAPSA-N
Data  2 IC50
  Tab Delimited (TSV)   2D SDfile   Computed 3D by Vconf -m prep SDfile
Find this compound or compounds like it in BindingDB:
Activity Spreadsheet -- Enzyme Inhibition Constant Data from BindingDB
Found 2 hits for monomerid = 419218
TargetInterleukin-17A(Homo sapiens (Human))
Galderma Research & Development
US Patent
LigandPNGBDBM419218(4-((((1R,5S,6S)-3- oxabicyclo[3.1.0]hexan-6- yl)me...)
Affinity DataIC50: <100nM. Assay description: This model allows measurement of the effect of inhibitors on IL-17A secretion by CD4+ cells. The cells are frozen CD4+ cells (STEMCELL, #70026), isol...
Ligand InfoPC cidPC sid
In DepthDetails US Patent
TargetNuclear receptor ROR-gamma(Homo sapiens (Human))
Galderma Research & Development
US Patent
LigandPNGBDBM419218(4-((((1R,5S,6S)-3- oxabicyclo[3.1.0]hexan-6- yl)me...)
Affinity DataIC50: <100nM. Assay description: The RORγ transactivation model was developed from the line HG5LN, which is a HeLa line that stably expresses a luciferase reporter gene controll...
Ligand InfoPC cidPC sid
In DepthDetails US Patent