BDBM41928 MLS000571481::N-(3,3-diphenylpropyl)-2-(5-morpholin-4-ylsulfonylthiophen-2-yl)acetamide::N-(3,3-diphenylpropyl)-2-(5-morpholin-4-ylsulfonylthiophen-2-yl)ethanamide::N-(3,3-diphenylpropyl)-2-(5-morpholinosulfonyl-2-thienyl)acetamide::N-(3,3-diphenylpropyl)-2-[5-(4-morpholinylsulfonyl)-2-thiophenyl]acetamide::SMR000150935::cid_5037436
SMILES O=C(Cc1ccc(s1)S(=O)(=O)N1CCOCC1)NCCC(c1ccccc1)c1ccccc1
InChI Key InChIKey=LCDGTCMXJBPYGQ-UHFFFAOYSA-N
Data  2 IC50
  Tab Delimited (TSV)   2D SDfile   Computed 3D by Vconf -m prep SDfile
Find this compound or compounds like it in BindingDB:
Activity Spreadsheet -- Enzyme Inhibition Constant Data from BindingDB
Found 2 hits for monomerid = 41928
TargetM1 family aminopeptidase(Plasmodium falciparum (isolate FcB1 / Columbia))
Srmlsc
Curated by PubChem BioAssay
LigandPNGBDBM41928(MLS000571481 | N-(3,3-diphenylpropyl)-2-(5-morphol...)
Affinity DataIC50:  2.76E+3nM. Assay description: Southern Research Molecular Libraries Screening Center (SRMLSC) Southern Research Institute (Birmingham, Alabama) NIH Molecular Libraries Screening...
In DepthDetails PCBioAssay
TargetBifunctional epoxide hydrolase 2(Homo sapiens (Human))
Columbia University Molecular Screening Center
Curated by PubChem BioAssay
LigandPNGBDBM41928(MLS000571481 | N-(3,3-diphenylpropyl)-2-(5-morphol...)
Affinity DataIC50:  36.1nM. Assay description: Data Source: Columbia University Molecular Screening Center Source (MLSCN Center Name): Columbia University Molecular Screening Center Center Affilia...
In DepthDetails PCBioAssay