BDBM420006 US10472364, Compound 78::US10570167, Cpd. # 78::US11034715, Cpd. # 78::US11208414, Cpd. # 78
SMILES Nc1nc(Cl)nc2n(cnc12)[C@@H]1O[C@H](COC(Cc2ccc(CC(O)=O)cc2)(C(O)=O)C(O)=O)[C@@H](O)[C@@H]1F
InChI Key InChIKey=NWCAHBBYZANXDO-VPSJLMRDSA-N
Data  7 IC50
  Tab Delimited (TSV)   2D SDfile   Computed 3D by Vconf -m prep SDfile
Find this compound or compounds like it in BindingDB:
Activity Spreadsheet -- Enzyme Inhibition Constant Data from BindingDB
Found 7 hits for monomerid = 420006
Target5'-nucleotidase(Homo sapiens (Human))
Calithera Biosciences
US Patent
LigandPNGBDBM420006(US10472364, Compound 78 | US10570167, Cpd. # 78 | ...)
Affinity DataIC50:  86nM. Assay description: For measurements of soluble CD73 enzyme activity, recombinant CD73 was obtained from R&D Systems, Cat. No. 5795-EN-010. Serial dilutions of test comp...
Ligand InfoKEGG
In DepthDetails US Patent
Target5'-nucleotidase(Homo sapiens (Human))
Calithera Biosciences
US Patent
LigandPNGBDBM420006(US10472364, Compound 78 | US10570167, Cpd. # 78 | ...)
Affinity DataIC50:  234nM. Assay description: For measurements of soluble CD73 enzyme activity, recombinant CD73 was obtained from R&D Systems, Cat. No. 5795-EN-010. Serial dilutions of test comp...
Ligand InfoKEGG
In DepthDetails US Patent
Target5'-nucleotidase(Homo sapiens (Human))
Calithera Biosciences
US Patent
LigandPNGBDBM420006(US10472364, Compound 78 | US10570167, Cpd. # 78 | ...)
Affinity DataIC50:  86nM. Assay description: For measurements of soluble CD73 enzyme activity, recombinant CD73 was obtained from R&D Systems, Cat. No. 5795-EN-010. Serial dilutions of test comp...
Ligand InfoKEGG
In DepthDetails US Patent
Target5'-nucleotidase(Homo sapiens (Human))
Calithera Biosciences
US Patent
LigandPNGBDBM420006(US10472364, Compound 78 | US10570167, Cpd. # 78 | ...)
Affinity DataIC50:  234nM. Assay description: The ability of compounds to inhibit endogenous, cell-bound CD73 enzyme activity was demonstrated using SK-MEL-28 cells, which express CD73 on their s...
Ligand InfoKEGG
In DepthDetails US Patent
Target5'-nucleotidase(Homo sapiens (Human))
Calithera Biosciences
US Patent
LigandPNGBDBM420006(US10472364, Compound 78 | US10570167, Cpd. # 78 | ...)
Affinity DataIC50:  234nM. Assay description: The ability of compounds to inhibit endogenous, cell-bound CD73 enzyme activity was demonstrated using SK-MEL-28 cells, which express CD73 on their s...
Ligand InfoKEGG
In DepthDetails US Patent
Target5'-nucleotidase(Homo sapiens (Human))
Calithera Biosciences
US Patent
LigandPNGBDBM420006(US10472364, Compound 78 | US10570167, Cpd. # 78 | ...)
Affinity DataIC50:  86nM. Assay description: For measurements of soluble CD73 enzyme activity, recombinant CD73 was obtained from R&D Systems, Cat. No. 5795-EN-010. Serial dilutions of test comp...
Ligand InfoKEGG
In DepthDetails US Patent
Target5'-nucleotidase(Homo sapiens (Human))
Calithera Biosciences
US Patent
LigandPNGBDBM420006(US10472364, Compound 78 | US10570167, Cpd. # 78 | ...)
Affinity DataIC50:  86nM. Assay description: For measurements of soluble CD73 enzyme activity, recombinant CD73 was obtained from R&D Systems, Cat. No. 5795-EN-010. Serial dilutions of test comp...
Ligand InfoKEGG
In DepthDetails US Patent