BDBM420290 HL-8
SMILES Oc1c(Cl)cc(Cl)cc1S(=O)(=O)c1cc(Cl)cc(Cl)c1O
InChI Key InChIKey=UOGGDVSNMLEDIZ-UHFFFAOYSA-N
Data  1 IC50
  Tab Delimited (TSV)   2D SDfile   Computed 3D by Vconf -m prep SDfile
Find this compound or compounds like it in BindingDB:
Activity Spreadsheet -- Enzyme Inhibition Constant Data from BindingDB
Found 1 hit for monomerid = 420290
TargetReplicase polyprotein 1a(Human SARS coronavirus (SARS-CoV))
National Taiwan University
LigandPNGBDBM420290(HL-8)
Affinity DataIC50:  9.20E+3nM. Assay description: To establish a high-throughput screening method, we designed a FRET peptide, Abz-SAVLQSGFRK-Dnp, as 3CLpro substrate. The FRET peptide was synthesize...
Ligand InfoPurchase
In DepthDetails ArticlePubMed