BDBM420302 9247873
SMILES COc1cc(CNC(=O)C2CCN(Cc3ccccc3)CC2)cc(OC)c1OC
InChI Key InChIKey=VCKQWDPRCASUMV-UHFFFAOYSA-N
Data  1 IC50
  Tab Delimited (TSV)   2D SDfile   Computed 3D by Vconf -m prep SDfile
Find this compound or compounds like it in BindingDB:
Activity Spreadsheet -- Enzyme Inhibition Constant Data from BindingDB
Found 1 hit for monomerid = 420302
TargetReplicase polyprotein 1ab(2019-nCoV)
University Of Georgia
LigandPNGBDBM420302(9247873)
Affinity DataIC50: >2.00E+5nM. Assay description: Emulating Ratia et al., who detailed the potency of these four compounds against SARS-CoV-1, we utilized the peptide-AMC substrate concentration of 5...
Ligand InfoPurchase
In DepthDetails ArticlePubMed