BDBM420318 Oritavancin (diphosphate)
SMILES CNC(CC(C)C)C(=O)NC1C(O)c2ccc(Oc3cc4cc(Oc5ccc(cc5Cl)C(OC5CC(C)(N)C(O)C(C)O5)C5NC(=O)C(NC(=O)C4NC(=O)C(CC(N)=O)NC1=O)c1ccc(O)c(c1)-c1c(O)cc(O)cc1C(NC5=O)C(O)=O)c3OC1OC(CO)C(O)C(O)C1OC1CC(C)(NCc3ccc(cc3)-c3ccc(Cl)cc3)C(O)C(C)O1)c(Cl)c2
InChI Key InChIKey=VHFGEBVPHAGQPI-UHFFFAOYSA-N
Data  1 IC50
  Tab Delimited (TSV)   2D SDfile   Computed 3D by Vconf -m prep SDfile
Find this compound or compounds like it in BindingDB:
Activity Spreadsheet -- Enzyme Inhibition Constant Data from BindingDB
Found 1 hit for monomerid = 420318
TargetReplicase polyprotein 1ab(2019-nCoV)
National Institutes Of Health
LigandPNGBDBM420318(Oritavancin (diphosphate))
Affinity DataIC50:  2.42E+4nM. Assay description: The 3CLpro enzyme assay was developed in 384-well black, medium binding microplates (Greiner Bio-One, Monroe, NC, USA) with a total volume of 20 _...
Ligand InfoPurchase
In DepthDetails ArticlePubMed