BDBM421055 US10479788, Example 166::US11046688, Example 166
SMILES COc1nc(ccc1Nc1ncc2ccnc(NCC(C)(C)OC)c2n1)-c1cnnn1C
InChI Key InChIKey=DUWXVPNCJMWLST-UHFFFAOYSA-N
Data  2 IC50
  Tab Delimited (TSV)   2D SDfile   Computed 3D by Vconf -m prep SDfile
Find this compound or compounds like it in BindingDB:
Activity Spreadsheet -- Enzyme Inhibition Constant Data from BindingDB
Found 2 hits for monomerid = 421055
TargetDual specificity protein kinase TTK(Homo sapiens (Human))
Cancer Research Technology
US Patent
LigandPNGBDBM421055(US10479788, Example 166 | US11046688, Example 166)
Affinity DataIC50:  3nM. Assay description: The enzyme reaction (total volume 10 μl) was carried out in black 384-well low volume plates containing full length MPS1 (12.5 nM or 3 nM), fluo...
Ligand Info
TargetDual specificity protein kinase TTK(Homo sapiens (Human))
Cancer Research Technology
US Patent
LigandPNGBDBM421055(US10479788, Example 166 | US11046688, Example 166)
Affinity DataIC50:  3nM. Assay description: The enzyme reaction (total volume 10 μl) was carried out in black 384-well low volume plates containing full length MPS1 (12.5 nM or 3 nM), fluo...
Ligand Info
In DepthDetails US Patent