BDBM421493 US10508086, Example 83::US10995073, Example 83
SMILES Cc1ncc(Cn2c3ccc(cc3n(-c3nnc(C)s3)c2=O)S(=O)(=O)NC2(C)CC2)s1
InChI Key InChIKey=DEJDCURLUNVOQT-UHFFFAOYSA-N
Data  4 IC50  2 EC50
  Tab Delimited (TSV)   2D SDfile   Computed 3D by Vconf -m prep SDfile
Find this compound or compounds like it in BindingDB:
Activity Spreadsheet -- Enzyme Inhibition Constant Data from BindingDB
Found 6 hits for monomerid = 421493
TargetPoly(ADP-ribose) glycohydrolase(Homo sapiens (Human))
Cancer Research Technology
US Patent
LigandPNGBDBM421493(US10508086, Example 83 | US10995073, Example 83)
Affinity DataEC50:  151nM. Assay description: PARG In vitro assays were conducted in a total volume of 15 ul in a standard 384 well format. 5 ul of Human Full Length PARG (Produced internally by ...
Ligand InfoPC cidPC sid
In DepthDetails US Patent
TargetADP-ribosylhydrolase ARH3(Homo sapiens (Human))
Cancer Research Technology
US Patent
LigandPNGBDBM421493(US10508086, Example 83 | US10995073, Example 83)
Affinity DataIC50: >1.00E+5nM. Assay description: ARH3 In vitro selectivity assays were conducted in a total volume of 15 ul in a standard 384 well format. 5 ul of Human Full Length ARH3 (Enzo Life S...
Ligand InfoPC cidPC sid
In DepthDetails US Patent
TargetPoly [ADP-ribose] polymerase 1(Homo sapiens (Human))
Cancer Research Technology
US Patent
LigandPNGBDBM421493(US10508086, Example 83 | US10995073, Example 83)
Affinity DataIC50: >1.50E+5nM. Assay description: PARP1 In vitro selectivity assays were conducted as a 10 ul reaction volume in a NUNC Maxisorp 384-well assay plate pre-coated in-house with Histones...
Ligand InfoPC cidPC sid
In DepthDetails US Patent
TargetPoly(ADP-ribose) glycohydrolase(Homo sapiens (Human))
Cancer Research Technology
US Patent
LigandPNGBDBM421493(US10508086, Example 83 | US10995073, Example 83)
Affinity DataEC50:  151nM. Assay description: PARG In vitro assays were conducted in a total volume of 15 ul in a standard 384 well format. 5 ul of Human Full Length PARG (Produced internally by ...
Ligand InfoPC cidPC sid
In DepthDetails US Patent
TargetADP-ribosylhydrolase ARH3(Homo sapiens (Human))
Cancer Research Technology
US Patent
LigandPNGBDBM421493(US10508086, Example 83 | US10995073, Example 83)
Affinity DataIC50: >1.00E+5nM. Assay description: ARH3 In vitro selectivity assays were conducted in a total volume of 15 ul in a standard 384 well format. 5 ul of Human Full Length ARH3 (Enzo Life S...
Ligand InfoPC cidPC sid
In DepthDetails US Patent
TargetPoly [ADP-ribose] polymerase 1(Homo sapiens (Human))
Cancer Research Technology
US Patent
LigandPNGBDBM421493(US10508086, Example 83 | US10995073, Example 83)
Affinity DataIC50: >1.50E+5nM. Assay description: PARP1 In vitro selectivity assays were conducted as a 10 ul reaction volume in a NUNC Maxisorp 384-well assay plate pre-coated in-house with Histones...
Ligand InfoPC cidPC sid
In DepthDetails US Patent