BDBM423413 WO2005113580-Ex-07
SMILES CCCC[C@H](NC(=O)c1cc2c(OC)cccc2[nH]1)C(=O)N[C@@H](C[C@@H]1CCNC1=O)C(=O)CCl
InChI Key InChIKey=HPAFHNQIPXJCFT-WBAXXEDZSA-N
Data  1 EC50
  Tab Delimited (TSV)   2D SDfile   Computed 3D by Vconf -m prep SDfile
Find this compound or compounds like it in BindingDB:
Activity Spreadsheet -- Enzyme Inhibition Constant Data from BindingDB
Found 1 hit for monomerid = 423413
TargetReplicase polyprotein 1ab(Human SARS coronavirus (SARS-CoV) (Severe acute re...)
Pfizer
WIPO
LigandPNGBDBM423413(WO2005113580-Ex-07)
Affinity DataEC50: >4.20E+4nM. Assay description: Protection from SARS Infection: Neutral Red Endpoint The ability of compounds to protect cells against infection by the SARS coronavirus is measured ...
Ligand InfoPC cidPC sid
In DepthDetails PubMed