BDBM42391 4-chloranyl-N-[2-[5-[2-(cyclopentylamino)-2-oxidanylidene-ethyl]sulfanyl-4-ethyl-1,2,4-triazol-3-yl]ethyl]benzamide::4-chloro-N-[2-(5-{[2-(cyclopentylamino)-2-oxoethyl]thio}-4-ethyl-4H-1,2,4-triazol-3-yl)ethyl]benzamide::4-chloro-N-[2-[5-[2-(cyclopentylamino)-2-oxoethyl]sulfanyl-4-ethyl-1,2,4-triazol-3-yl]ethyl]benzamide::4-chloro-N-[2-[5-[[2-(cyclopentylamino)-2-keto-ethyl]thio]-4-ethyl-1,2,4-triazol-3-yl]ethyl]benzamide::4-chloro-N-[2-[5-[[2-(cyclopentylamino)-2-oxoethyl]thio]-4-ethyl-1,2,4-triazol-3-yl]ethyl]benzamide::MLS000050352::SMR000077613::cid_2959770
SMILES CCn1c(CCNC(=O)c2ccc(Cl)cc2)nnc1SCC(=O)NC1CCCC1
InChI Key InChIKey=RYVQRYUXUQZUPT-UHFFFAOYSA-N
Data  1 EC50
  Tab Delimited (TSV)   2D SDfile   Computed 3D by Vconf -m prep SDfile
Find this compound or compounds like it in BindingDB:
Activity Spreadsheet -- Enzyme Inhibition Constant Data from BindingDB
Found 1 hit for monomerid = 42391
TargetLysosomal acid glucosylceramidase(Homo sapiens (Human))
The Scripps Research Institute Molecular Screening Center
Curated by PubChem BioAssay
LigandPNGBDBM42391(4-chloranyl-N-[2-[5-[2-(cyclopentylamino)-2-oxidan...)
Affinity DataEC50: >5.00E+4nM. Assay description: Source (MLSCN Center Name): The Scripps Research Institute Molecular Screening Center Center Affiliation: The Scripps Research Institute, TSRI Assay ...
In DepthDetails PCBioAssay