BDBM424442 US10508120, Compound I-897::US10577373, Compound I-897::US11046698, Compound I-897
SMILES CNc1cc(Nc2cccn(C3CCN(CCF)CC3)c2=O)nc2c(cnn12)C(=O)N[C@@H]1CC[C@@H]1O
InChI Key InChIKey=RVDUIHZJBIKCLU-MJGOQNOKSA-N
Data  3 Kd
  Tab Delimited (TSV)   2D SDfile   Computed 3D by Vconf -m prep SDfile
Find this compound or compounds like it in BindingDB:
Activity Spreadsheet -- Enzyme Inhibition Constant Data from BindingDB
Found 3 hits for monomerid = 424442
TargetNon-receptor tyrosine-protein kinase TYK2 [556-888](Homo sapiens (Human))
Nimbus Lakshimi
US Patent
LigandPNGBDBM424442(US10508120, Compound I-897 | US10577373, Compound ...)
Affinity DataKd:  0.600nM. Assay description: Binding constants for compounds of the present invention against the JH2 domain were determined by the following protocol for a KINOMEscan® assay (Di...
Ligand InfoPC cidPC sid
In DepthDetails US Patent
TargetNon-receptor tyrosine-protein kinase TYK2 [556-888](Homo sapiens (Human))
Nimbus Lakshimi
US Patent
LigandPNGBDBM424442(US10508120, Compound I-897 | US10577373, Compound ...)
Affinity DataKd:  0.600nM. Assay description: Binding constants for compounds of the present invention against the JH2 domain were determined by the following protocol for a KINOMEscan® assay (Di...
Ligand InfoPC cidPC sid
In DepthDetails US Patent
TargetNon-receptor tyrosine-protein kinase TYK2 [556-888](Homo sapiens (Human))
Nimbus Lakshimi
US Patent
LigandPNGBDBM424442(US10508120, Compound I-897 | US10577373, Compound ...)
Affinity DataKd:  0.600nM. Assay description: Binding constants for compounds of the present invention against the JH2 domain were determined by the following protocol for a KINOMEscan® assay (Di...
Ligand InfoPC cidPC sid
In DepthDetails US Patent