BDBM425115 US10519167, Compound 3::US11028101, Compound 3
SMILES CCOc1cc(ccc1C(=O)N(C)C[C@@H](O)[C@@H]1Cc2ccccc2CN1)C(=O)N1C2CCC1COC2
InChI Key InChIKey=MMJPLVGKZCNIQQ-UIIQDGRDSA-N
Data  2 IC50
  Tab Delimited (TSV)   2D SDfile   Computed 3D by Vconf -m prep SDfile
Find this compound or compounds like it in BindingDB:
Activity Spreadsheet -- Enzyme Inhibition Constant Data from BindingDB
Found 2 hits for monomerid = 425115
TargetProtein arginine N-methyltransferase 5(Homo sapiens (Human))
Ctxt
US Patent
LigandPNGBDBM425115(US10519167, Compound 3 | US11028101, Compound 3)
Affinity DataIC50:  36nM. Assay description: The 6 μL reactions are run in Greiner brand black 384-well low volume assay plates. All reactions contained assay buffer (phosphate buffered sal...
Ligand InfoPC cidPC sid
In DepthDetails US Patent
TargetProtein arginine N-methyltransferase 5(Homo sapiens (Human))
Ctxt
US Patent
LigandPNGBDBM425115(US10519167, Compound 3 | US11028101, Compound 3)
Affinity DataIC50:  36nM. Assay description: The 6 μL reactions are run in Greiner brand black 384-well low volume assay plates. All reactions contained assay buffer (phosphate buffered sal...
Ligand InfoPC cidPC sid
In DepthDetails US Patent